8.0.1 compilation error on openSUSE

Image Ici on parle français ou anglais, comme on veut, comme on peut.
Image Here we speak french or english, as we want, as we can.

Moderator: jza

Forum rules
Image Ici on parle français ou anglais, comme on veut, comme on peut, mais on n'oublie jamais que l'on discute entre humains.
Les messages impolis sont rejetés et restent sans réponse.
Il faut souvent être patient, car il y a plein d'autres activités encore plus passionantes dans notre vie.

Image Here we speak french or english, as we want, as we can, but we never forget that we discuss between humans.
Rude messages are rejected and remain unanswered.
It is often necessary to be patient because there are many other activities even more exciting in our life.
Post Reply
coogor
Posts: 43
Joined: 29 Mar 2010 10:04

8.0.1 compilation error on openSUSE

Post by coogor » 09 Dec 2016 17:08

Wow, an upgrade to zyGrib after nearly 2 years! This is great!
I put this immeadiately onto OBS, but I run into a compilation error:

Code: Select all

[   91s] gcc -c -O3 -g -m64 -I/nwprod/lib/include/ -DUSE_JPEG2000 -DUSE_PNG -D__64BIT__ dec_jpeg2000.c
[   91s] dec_jpeg2000.c:8:27: fatal error: jasper/jasper.h: No such file or directory
[   91s]  #include "jasper/jasper.h"
Is there a dependency missing?

coogor
Posts: 43
Joined: 29 Mar 2010 10:04

Re: 8.0.1 compilation error on openSUSE

Post by coogor » 21 Dec 2016 12:36

Solved the last issue (libjpeg-devel was a build-requirement) and immediately jumped into the next issue, related to qt: Which qt-Version is expected?

coogor
Posts: 43
Joined: 29 Mar 2010 10:04

Re: 8.0.1 compilation error on openSUSE

Post by coogor » 03 Jan 2017 13:34

I'm getting closer...after some includes and patches I'm now at a new error:

Code: Select all

[   63s] compiling qwt_slider.cpp
[   63s] compiling qwt_thermo.cpp
[   64s] compiling qwt_wheel.cpp
[   64s] moc qwt_dyngrid_layout.h
[   64s] moc qwt_magnifier.h
[   65s] usr/include/c++/4.8/bits/stl_relops.:67: Parse error at "std"
[   65s] Makefile:739: recipe for target 'moc/moc_qwt_dyngrid_layout.cpp' failed
[   65s] make[1]: *** [moc/moc_qwt_dyngrid_layout.cpp] Error 1
[   65s] make[1]: *** Waiting for unfinished jobs....
[   65s] usr/include/c++/4.8/bits/stl_relops.:67: Parse error at "std"
[   65s] Makefile:743: recipe for target 'moc/moc_qwt_magnifier.cpp' failed
[   65s] make[1]: *** [moc/moc_qwt_magnifier.cpp] Error 1
Any idea?

coogor
Posts: 43
Joined: 29 Mar 2010 10:04

Re: 8.0.1 compilation error on openSUSE

Post by coogor » 09 Jan 2017 19:51

Just to let you know, compilation errors are resolved and zyGrib is now available for openSUSE Leap, Tumbleweed, and PowerPC:
https://build.opensuse.org/package/show ... Geo/zyGrib

Post Reply

Who is online

Users browsing this forum: Google [Bot] and 1 guest